Movidius da Tensorflow düzenleme hatası


#1

buradaki Raspberrypi Movidius blog yazsında ncappzoo altında tensorflow klasörünün oraya girip sudo make yapınca aşağıdaki gibi hata aldım. ne yapmam gerekir?

test -f output/inception-v2.meta || ./save_session.py
Traceback (most recent call last):
File “./save_session.py”, line 7, in
import tensorflow as tf
ImportError: No module named ‘tensorflow’
Makefile:46: recipe for target ‘weights’ failed
make[1]: *** [weights] Error 1
make[1]: Leaving directory ‘/home/pi/ncappzoo/tensorflow/inception_v2’
Makefile:12: recipe for target ‘inception_v2/.’ failed
make: *** [inception_v2/.] Error 2
pi@raspberrypi:~/ncappzoo/tensorflow $ ls
facenet inception_v1 inception_v4 mobilenets tf_models
inception inception_v2 Makefile MTCNN tf_src
inception_resnet_v2 inception_v3 mnist README.md